android studio 工程升级到 sdk 23后,报错?报错-问答-阿里云开发者社区-阿里云

开发者社区> 问答> 正文

android studio 工程升级到 sdk 23后,报错?报错

爱吃鱼的程序员 2020-06-09 15:54:16 141

报错如下,请问,该如何解决?

family\djtFamily3\build\intermediates\transforms\jarMerging\debug\jars\1\1f\combined.jar]

:djtFamily3:transformClassesWithMultidexlistForDebug FAILED
Error:Execution failed for task ':djtFamily3:transformClassesWithMultidexlistForDebug'.
> java.io.IOException: Can't read [D:\tongy-family\djtFamily3\build\intermediates\transforms\jarMerging\debug\jars\1\1f\combined.jar] (Can't process class [com/yixia/camera/demo/ui/record/helper/ThemeHelper.class] (Unknown verification type [10] in stack map frame))
Information:BUILD FAILED
Information:Total time: 20.429 secs
Information:1 error
Information:0 warnings
Information:See complete output in console

开发工具 Android开发
分享到
取消 提交回答
全部回答(1)
  • 爱吃鱼的程序员
    2020-06-09 15:54:33

    升级到sdk23是啥意思?

    compileSdkVersion?

    buildToolsVersion?

    minSdkVersion?

    targetSdkVersion?

    请问下楼主怎么解决的

    和我的错一模一样

    我的解决方案是删除了这个类所在jar包 [com/yixia/camera/demo/ui/record/helper/ThemeHelper.class就可以正常编译了

    0 0
开发与运维
使用钉钉扫一扫加入圈子
+ 订阅

集结各类场景实战经验,助你开发运维畅行无忧

推荐文章
相似问题