PHP编译,执行make报错-阿里云开发者社区

开发者社区> 数据库> 正文
登录阅读全文

PHP编译,执行make报错

简介:

编译安装php 的时候, 执行make报错误

make: *** [ext/phar/phar.php] 错误 127


[root@localhost php-5.4.9]# mkdir /usr/local/webserver/mysql/include/mysql

 [root@localhost php-5.4.9]# ln -s /usr/local/webserver/mysql/include/* /usr/local/webserver/mysql/include/mysql

 [root@localhost php-5.4.9]# make ZEND_EXTRA_LIBS='-liconv'

抛错:

Generating phar.phar

/usr/local/src/php-5.4.9/sapi/cli/php: error while loading shared libraries: libiconv.so.2: cannot open shared object file: No such file or directory

make: *** [ext/phar/phar.php] Error 127


解决的方法如下:

#vi /etc/ld.so.conf

在里面加上一行

/usr/local/lib

2.然后运行/sbin/ldconfig

#/sbin/ldconfig

编译make

#make ZEND_EXTRA_LIBS='-liconv'

抛错:

Generating phar.phar

chmod: cannot access `ext/phar/phar.phar': No such file or directory

make: [ext/phar/phar.phar] Error 1 (ignored)


Build complete.

Don't forget to run 'make test'.

此处可以忽略 不过解决办法如下

#cd  ext/phar/

#cp ./phar.php  ./phar.phar

然后到php5.4文件夹

#make ZEND_EXTRA_LIBS='-liconv'

#make test

#make install



本文转自 维度2018 51CTO博客,原文链接:http://blog.51cto.com/xinsz08/1795767,如需转载请自行联系原作者

版权声明:本文内容由阿里云实名注册用户自发贡献,版权归原作者所有,阿里云开发者社区不拥有其著作权,亦不承担相应法律责任。具体规则请查看《阿里云开发者社区用户服务协议》和《阿里云开发者社区知识产权保护指引》。如果您发现本社区中有涉嫌抄袭的内容,填写侵权投诉表单进行举报,一经查实,本社区将立刻删除涉嫌侵权内容。

分享:
数据库
使用钉钉扫一扫加入圈子
+ 订阅

分享数据库前沿,解构实战干货,推动数据库技术变革

其他文章
最新文章
相关文章