configure: error: no acceptable C compiler found in $PATH

简介:

今天源码安装mysql遇到报错:

1
2
3
4
5
6
7
8
9
checking  for  gawk ...  gawk
checking whether  make  sets $(MAKE)...  yes
checking how to create a ustar  tar  archive... gnutar
checking  for  style of include used by  make ... GNU
checking  for  gcc... no
checking  for  cc... no
checking  for  cl.exe... no
configure: error:  in  ` /Disk/mysql_source/mysql-5 .1.72':
configure: error: no acceptable C compiler found  in  $PATH

解决办法:

1
yum  install  gcc










本文转自 xinsir999 51CTO博客,原文链接:http://blog.51cto.com/xinsir/1748933,如需转载请自行联系原作者
目录
相关文章
|
7月前
|
Python
ERROR: Failed building wheel for osgeo
ERROR: Failed building wheel for osgeo
167 0
|
10月前
|
开发工具
WARNING: library configuration mismatch
WARNING: library configuration mismatch
219 0
configure: error: libacl not found
configure: error: libacl not found
64 0
configure: error: gperf is needed
configure: error: gperf is needed
96 0
解决办法:configure: error: You requested SRTP (requires libsrtp) but not found...die
解决办法:configure: error: You requested SRTP (requires libsrtp) but not found...die
119 0
configure: error: You requested LIBYUV but not found...die
configure: error: You requested LIBYUV but not found...die
72 0
|
Perl
ld: symbol(s) not found for architecture x86_64 clang: error: linker command failed with exit code 1
ld: symbol(s) not found for architecture x86_64 clang: error: linker command failed with exit code 1
611 0
|
网络协议 关系型数据库 Linux
onfigure: error: no acceptable C compiler found in $PATH See `config.log' for more details 问题解决
onfigure: error: no acceptable C compiler found in $PATH See `config.log' for more details 问题解决
152 0
|
Java Linux
error: Failed dependencies: libjvm.so()(64bit) is needed by (installed)
error: Failed dependencies: libjvm.so()(64bit) is needed by (installed)
error: Failed dependencies: libjvm.so()(64bit) is needed by (installed)
configure: error: readline library not found/libreadline.so: undefined reference to tputs
configure: error: readline library not found/libreadline.so: undefined reference to tputs
332 0