• 关于

    报错Compilation?Error

    的搜索结果

回答

求教idea中编译项目如下错误&xff01;java:javacTask:源版本 1.6 需要目标版本 1.6 java:Errors occurred while compiling module&39;org.springframework.samples.jpetstore&39;Compilation completed with 1 error...
爱吃鱼的程序员 2020-06-22 22:11:04 0 浏览量 回答数 1

回答

127.0.0.1:81/index.cgi后会报错&xff1a;Software error: The./data/params file does not exist.You probably need to run checksetup.pl.at Bugzilla/Config.pm line 314. Compilation failed in require at c:\...
爱吃鱼的程序员 2020-06-22 17:29:03 0 浏览量 回答数 1

回答

c报错 在编写样例代码时出现这种问题。这种情况应该如何解决和避免那&xff1f;fatal error C1003:error count exceeds number;stopping compilation 原因是什么&xff0c;为什么会发生异常&xff0c;以及下面到底发生了什么...
爱吃鱼的程序员 2020-05-28 17:28:48 3 浏览量 回答数 1

回答

c报错 在编写样例代码时出现这种问题。这种情况应该如何解决和避免那&xff1f;fatal error C1003:error count exceeds number;stopping compilation 原因是什么&xff0c;为什么会发生异常&xff0c;以及下面到底发生了什么...
爱吃鱼的程序员 2020-05-28 09:14:52 3 浏览量 回答数 1

回答

c报错 在编写样例代码时出现这种问题。这种情况应该如何解决和避免那&xff1f;fatal error C1903:unable to recover from previous error(s);stopping compilation 原因是什么&xff0c;为什么会发生异常&xff0c;以及下面...
爱吃鱼的程序员 2020-05-28 09:14:36 3 浏览量 回答数 1

回答

报错说明为&xff1a;Exception in thread&34;main&34;java.lang.Error:Unresolved compilation problem:The method Isn(int)is undefined for the type Even_num at day07.Even_num.main(Even_num.java:11)
爱吃鱼的程序员 2020-06-24 13:28:31 0 浏览量 回答数 1

回答

报错的那行代码很简单&xff0c;就是&xff1a;String json&61;“很长很长的一个json字符串。同样的代码&xff0c;在另一个非maven工程中就可以正常打包。或者在这个maven工程下&xff0c;把字符串改的很短&xff0c;也可以通过。
爱吃鱼的程序员 2020-06-08 10:52:32 0 浏览量 回答数 1

回答

c报错 在编写样例代码时出现这种问题。这种情况应该如何解决和避免那&xff1f;fatal error C1903:unable to recover from previous error(s);stopping compilation 原因是什么&xff0c;为什么会发生异常&xff0c;以及下面...
爱吃鱼的程序员 2020-05-28 17:28:41 3 浏览量 回答数 1

回答

0,0)方法报错&xff0c;提示 java.lang.Error:Unresolved compilation problem:The type java.lang.CharSequence cannot be resolved.It is indirectly referenced from required.class files&xff0c;各位有什么解决办法...
爱吃鱼的程序员 2020-06-23 16:24:15 0 浏览量 回答数 1

回答

Failed to execute goal org.apache.maven.plugins:maven-compiler-plugin:3.8.1:compile(default-compile)on project x_query_core_entity:Compilation failure:Compilation failure:[ERROR]/D:/o2oashengjiban/o2...
爱吃鱼的程序员 2020-06-05 14:48:59 0 浏览量 回答数 1

回答

64;CrawlScript 你好&xff0c;...这里提示报错&xff0c;Exception in thread&34;main&34;java.lang.Error:Unresolved compilation problem:Cannot cast from Object to int 请回复一下&xff0c;很重要&xff0c;谢谢。
爱吃鱼的程序员 2020-06-15 19:23:23 0 浏览量 回答数 1

回答

COMPILATION ERROR: [INFO]- [ERROR]No compiler is provided in this environment.Perhaps you are running on a JRE rather than a JDK?[INFO]1 error [INFO]- [INFO]- [INFO]BUILD FAILURE [INFO]- [INFO]Total ...
爱吃鱼的程序员 2020-06-07 21:51:33 0 浏览量 回答数 1

回答

[ERROR]Failed to execute goal org.apache.maven.plugins:maven-compiler-plugin:3.1:compile(default-compile)on project syweb:Compilation failure[ERROR]/C:/Users/863/Desktop/wwwcrm/syweb/src/main/java/...
爱吃鱼的程序员 2020-06-09 12:45:49 0 浏览量 回答数 1

回答

Information:2015-09-25 16:44-Compilation completed with 1 error and 0 warnings in 3 sec E:\project\prjJfinal\eova\src\main\java\com\eova\template\common\util\UIUtil.java Error:(43,56)java:E:\project\...
爱吃鱼的程序员 2020-06-12 11:00:15 0 浏览量 回答数 1

回答

报错 [ERROR]Failed to execute goal org.apache.maven.plugins:maven-compiler-plugin:3.1:compile(default-compile)on project springside-core:Compilation failure[ERROR]/E:/springside4-4.1.0.GA/modules/core...
爱吃鱼的程序员 2020-06-22 17:58:23 0 浏览量 回答数 1

回答

然后当我对pom.xml文件执行install的时候就报错了&xff0c;弄了好几天都没办法&xff0c;求大神指点一下小弟啊。[ERROR]Failed to execute goal org.apache.maven.plugins:maven-compiler-plugin:3.1:compile(default-...
爱吃鱼的程序员 2020-06-09 13:15:45 0 浏览量 回答数 1

回答

import java.util.*;public class A3{ public static void main(String[]args){ ...报错的内容&xff1a;Exception in thread&34;main&34;java.lang.Error:Unresolved compilation problem:Duplicate local variable B
爱吃鱼的程序员 2020-06-23 15:18:15 0 浏览量 回答数 1

回答

400 报错 已经装了gmp mpfr mpc builtutil这四个组件 cygwin内置GCC版本4.5.2 ARM版linux 版本linaro-4.6 编译参数如下&xff1a;configure-prefix&61;home/ztcc/acc-target&61;arm-none-linux-gnueabi-disable-shared-...
爱吃鱼的程序员 2020-06-01 10:16:12 0 浏览量 回答数 1

回答

在编译项目时出现BUILD FAILURE,报错如下&xff1a;Failed to execute goal org.apache.maven.plugins:maven-compiler-plugin:2.3.2:compile(default-compile)on project sakai-content-tool:Compilation failure. ...
爱吃鱼的程序员 2020-06-22 11:51:29 0 浏览量 回答数 1

回答

用maven install会报错&xff0c;异常如下: [ERROR]Failed to execute goal org.apache.maven.plugins:maven-compiler-plugin:3.1:compile(default-compile)on project project_name:Compilation failure[ERROR]/D:/git...
爱吃鱼的程序员 2020-06-14 16:50:34 0 浏览量 回答数 1

回答

import java.awt.;import javax.swing.;public class 窗口 extends JFrame{ package CreateJFrame/*&64;...to complete EnumDeclaration Exameple1 cannot be resolved to a type 编写代码时报错&xff0c;求大神解答一下
爱吃鱼的程序员 2020-06-23 13:53:11 0 浏览量 回答数 1

回答

上面这段代码 运行报错 Compilation errors for PACKAGE ANY3_BPMAPP.WF_APP_PACKAGE Error:PLS-00103:Encountered the symbol&34;CREATE&34;Line:5 Text:create OR REPLACE PACKAGE BODY WF_APP_PACKAGE AS 数据库...
爱吃鱼的程序员 2020-06-15 19:39:51 0 浏览量 回答数 1

回答

也没有地方报错,就是install的时候报错 不是个别mapper找不到pojo 是全部都 整合后的application.properties里面都写什么百度看的写的都不太一样;到底写哪些,求大牛解答 谢谢 dao install [ERROR]/F:/develop2/...
爱吃鱼的程序员 2020-06-06 15:21:24 0 浏览量 回答数 1

回答

构建报错&xff08;试了很多版本的 Linux&xff0c;Maven 版本也试了几个&xff0c;都是报同一个错&xff09;报错信息 [INFO]- [INFO]BUILD FAILURE [INFO]- [INFO]Total time:02:17 min [INFO]Finished at:2017-09-14T23:05:52-...
爱吃鱼的程序员 2020-06-08 10:49:03 0 浏览量 回答数 1

回答

报错如下: 严重:Servlet.service()for servlet[spring]in context with path[/toms]threw exception[Handler processing failed;nested exception is java.lang.Error:Unresolved compilation problems:Columu ...
爱吃鱼的程序员 2020-06-10 10:50:32 0 浏览量 回答数 1

回答

但是在eclipse里面就报错&xff1a;[INFO]BUILD FAILURE[INFO]-[INFO]Total time:2.229s[INFO]Finished at:Tue Apr 15 14:02:39 CST 2014[INFO]Final Memory:9M/22M[INFO]-[ERROR]Failed to execute goal org.apache....
爱吃鱼的程序员 2020-06-22 10:47:19 0 浏览量 回答数 1

回答

发现 报错 pagination.tag 中找不到 spring-data-commons-1.9.1.RELEASE 中的方法 看jar包源码发现这个版本确实没有那些方法了 1.8的有那些方法,以下两个方法是不是说这个版本应该有新的处理方式。hasPreviousPage()...
爱吃鱼的程序员 2020-06-14 17:30:27 0 浏览量 回答数 1

回答

看了日志编译报错如下&xff1a;NFO]-maven-resources-plugin:2.6:resources(default-resources)&64;zpxmaven-WARNING]Using platform encoding(UTF-8 actually)to copy filtered resources,i.e.build is platform ...
爱吃鱼的程序员 2020-06-14 16:55:07 0 浏览量 回答数 1

回答

[INFO]Compiling 156 source files to D:\My_Pro\zhongjian-bns\zhongjian-bns-webapp\src\main\webapp\WEB-INF\classes 致命错误:在类路径或引导类路径中找不到程序包 java.lang[INFO]-[ERROR]COMPILATION ERROR:...
爱吃鱼的程序员 2020-06-12 10:48:21 0 浏览量 回答数 1

回答

[INFO]Compiling 9 source files to F:\stsWorkSpace\studyWork\spring-boot-study\target\classes[INFO]-[ERROR]COMPILATION ERROR:[INFO]-[ERROR]No compiler is provided in this environment.Perhaps you are ...
爱吃鱼的程序员 2020-06-06 15:09:24 0 浏览量 回答数 1

云产品推荐

视频直播 大数据计算服务 MaxCompute 国内短信套餐包 ECS云服务器安全配置相关的云产品 开发者问答 阿里云建站 新零售智能客服 万网 小程序开发制作 视频内容分析 视频集锦 代理记账服务 阿里云AIoT 阿里云科技驱动中小企业数字化