• 关于

    occurred

    的搜索结果

回答

CURL请求数据,提示Sorry,an error occurred while processing your request.是什么问题,希望大家解答一下 Sorry,an error occurred while processing your request.对不起,有错误发生,而处理您的请求。400 报错 ...
爱吃鱼的程序员 2022-04-07 09:51:18 266 浏览量 回答数 1

回答

print('An IOError occurred.{}'.format(e.args[-1])) finally: print("This would be printed whether or not an exception occurred!Output:An IOError occurred.No such file or directory This would be ...
montos 2022-04-03 00:18:21 0 浏览量 回答数 0

回答

400 EnvDeleteFailed An error occurred while deleting the application environment.This environment may have been deleted,or an error occurred while the server was deleting the environment configuration...
小天使爱美 2022-04-03 22:50:59 0 浏览量 回答数 0

回答

我创建maven项目的时候,总是报错:Errors occurred during the build.Errors running builder 'Maven Project Builder' on project 'zxwl'.org/apache/maven/project/MavenProject An internal error occurred ...
爱吃鱼的程序员 2022-04-06 18:36:47 228 浏览量 回答数 1

回答

Errors occurred during the build. Errors running builder 'Maven Project Builder' on project 'zxwl'. org/apache/maven/project/MavenProject An internal error occurred during:"Creating maven-archetype-...
kun坤 2022-04-07 07:14:32 218 浏览量 回答数 1

回答

try:#some code except ZeroDivisionError as e:#some code print("ZeroDivisionError occurred:{}".format(e)) 应该会输出如下所示的结果: ZeroDivisionError occurred:division by zero 因此依然可以访问错误消息...
游客qwertyuiop123 2022-04-03 15:27:59 0 浏览量 回答数 0

回答

MySQL启动提示Timeout error occurred错误
montos 2022-04-07 06:27:23 206 浏览量 回答数 2

回答

电脑重新启动后登录wordpress出现 an error occurred怎么办
刘兴阳 2022-04-07 04:16:00 514 浏览量 回答数 1

回答

eclipse启动不了,报错An internal error occurred during:"reload maven project". 现在启动不了,怎么办
爱吃鱼的程序员 2022-04-06 16:35:43 178 浏览量 回答数 1

回答

An ERROR occurred,the installation cannot continue.FATAL EXCEPTION at/opt/hyperic-hq-installer-4.6.6/installer/data/setup.xml:523:The following error occurred while executing this line:/opt/hyperic-hq...
爱吃鱼的程序员 2022-04-06 17:51:56 166 浏览量 回答数 1

回答

eclipse启动不了,报错An internal error occurred during:"reload maven project".现在启动不了,怎么办
爵霸 2022-04-07 05:31:01 1800 浏览量 回答数 1

回答

项目根目录下运行ant release报错:BUILD FAILED/home/adt-bundle-linux-x86_64-20130717/sdk/tools/ant/build.xml:885:The following error occurred while executing this line: home/adt-bundle-linux-x86_64-...
爱吃鱼的程序员 2022-04-06 18:26:57 158 浏览量 回答数 1

回答

使用IDEA建了个普通springboot工程,启动运行时直接报错 Error:A JNI error has occurred,please check your installation and try again Exception in thread"main
佚名4918 2022-04-07 03:03:31 182 浏览量 回答数 0

回答

home/adt-bundle-linux-x86_64-20130717/sdk/tools/ant/build.xml:887:The following error occurred while executing this line:/home/adt-bundle-linux-x86_64-20130717/sdk/tools/ant/build.xml:899:The ...
爱吃鱼的程序员 2022-04-07 08:13:57 219 浏览量 回答数 1

回答

在eclipse中创建和打开安卓模拟器时出现An error has occurred.See error log for more details.java.lang.NullPointerException。这是怎么回事啊?
爵霸 2022-04-07 05:57:18 3046 浏览量 回答数 1

回答

A Database Error Occurred Error Number:ERROR:relation"actsysidseq"does not exist LINE 1:select nextval('actsysidseq')as sysid^select nextval('actsysidseq')as sysid Filename:/var/...
kun坤 2022-04-06 16:27:47 179 浏览量 回答数 1

回答

我做了个Web API,在本地调试是没问题的,但是发布到服务器以后出现一POST就出现{"Message":"An error has occurred"},用Fiddler4调试出现错误代码500,新手,求救命 Windows Server2016
larrywei 2022-04-07 02:36:47 4462 浏览量 回答数 1

回答

The error occurred in ibatis/secondary/sqlmap/task_otherthread.xml.-The error occurred while applying a parameter map.-Check the TaskOtherThreadDao.insertWoman-InlineParameterMap.-Check the statement...
落地花开啦 2022-04-06 22:45:32 2803 浏览量 回答数 1

回答

ReAn error occurred 应该是你部署上去的war包有问题,看看改动了什么,如果恢复到旧的war包没有问题,那1000%就是你改动代码的时候导致的问题 ReAn error occurred 如果用maven install 打的包,打包的时候没有问题...
xiaoboy 2022-04-03 07:13:04 0 浏览量 回答数 0

回答

提取特征超时 AccessEngineFailed 500 An error occurred while accessing the search engine.访问引擎失败 InternalOssError 500 An internal OAS error occurred.内部OAS错误 InternalSwiftError 500 An internal ...
保持可爱mmm 2022-04-03 23:37:58 0 浏览量 回答数 0

回答

An error occurred executing SQL in part[openQuery:get rowinfo]:SELECT NAME,MODIFIED_USER,MODIFIED_DATE,DESCRIPTION,ID_JOB FROM R_JOB WHERE ID_DIRECTORY=?For input string:"4294967295 具体换那个目录下的...
爱吃鱼的程序员 2022-04-06 18:38:13 1123 浏览量 回答数 1

回答

27 00 00 00 00 00 e0 00 02:17:23.503 READ NATIVE MAX ADDRESS EXTError 14812 occurred at disk power-on lifetime:13861 hours(577 days+13 hours)When the command that caused the error occurred,the ...
kun坤 2022-04-03 06:14:42 0 浏览量 回答数 0

回答

Problem Occurred 'Building workspace' has encountered aproblem. Errors occurred during the build. 中文翻译: 问题发生 “构建工作区”遇到了一个问题。生成过程中发生错误。我知道这是很低级的问题,但是我搞了...
爱吃鱼的程序员 2022-04-07 10:01:07 775 浏览量 回答数 1

回答

print("An error occurred.{}".format(e.args[-1])) 另外一种方式是对每个单独的异常在单独的except语句块中处理。我们想要多少个except语句块都可以。这里是个例子: try: file=open('test.txt','rb') except ...
montos 2022-04-03 00:18:20 0 浏览量 回答数 0

回答

ERROR:TunnelException-ErrorCode=Local Error,ErrorMessage=400FAILED:error occurred while running tunnel commandodps@demo987654321>tunnel upload C:/work/BI/odpscmd_public_May/ipdata.txt.utf8 ipresource;...
pengchao 2022-04-06 18:39:41 3479 浏览量 回答数 1

回答

报错Internal Server Error CDbConnection failed to open the DB connection.An internal error occurred while the Web server was processing your request.Please contact the webmaster to report this problem...
之间网 2022-04-07 03:20:07 4144 浏览量 回答数 1

回答

o 各位大佬,请教个问题,我自己实现了一个admission controller,本身调用都正常,但是k8s报错:Error from server(InternalError):error when creating"test_app.yaml":Internal error occurred:Internal error ...
问问小秘 2022-04-06 22:28:57 246 浏览量 回答数 2

回答

Caused by:com.ibatis.common.jdbc.exception.NestedSQLException:    --- The error occurred in com/ait/hrm/sql/empinfo/sql.xml.   --- The error occurred while applying a parameter map.-Check the hrm.empinfo....
爱吃鱼的程序员 2022-04-06 18:16:05 157 浏览量 回答数 1

回答

The error occurred while applying a parameter map. Check the hrm.empinfo.retrieveEvaluateByMonth-InlineParameterMap. Check the statement(query failed). Cause:java.sql.SQLException:ORA-00911:无效字符 ...
kun坤 2022-04-07 09:14:45 235 浏览量 回答数 1

回答

logging.error('Error occurred') logging.critical('Critical error-shutting down') 运行报错:日志为什么没有输出DEBUG级别的日志 INFO:root:Informational message WARNING:root:Warning:config file server.conf...
水果黄瓜 2022-04-07 04:13:48 182 浏览量 回答数 2

云产品推荐

视频直播 大数据计算服务 MaxCompute 国内短信套餐包 ECS云服务器安全配置相关的云产品 开发者问答 阿里云建站 新零售智能客服 万网 小程序开发制作 视频内容分析 视频集锦 代理记账服务 阿里云AIoT 阿里云科技驱动中小企业数字化