• 关于

    this-error

    的搜索结果

问题

Hyperic HQ 4.6.6 安装问题报错?报错

Loading install configuration... Install configuration loaded. Preparing to install... Validating server install conf...
爱吃鱼的程序员 2020-06-15 19:38:33 0 浏览量 回答数 1

问题

maven报错了?报错

COMPILATION ERROR : [INFO] ------------------------------------------------------------- [ERROR] No compiler is provide...
爱吃鱼的程序员 2020-06-07 21:51:33 0 浏览量 回答数 1

问题

java 自定义异常作为常量时,打印的异常信息不对 报错

" 问题描述 当把异常作为常量时,打印的异常调用链不对 相关代码 异常类 public class UserException extends RuntimeException { private ...
因为相信,所以看见。 2020-05-26 13:56:03 15 浏览量 回答数 1

回答

回 1楼iceman0923的帖子 Yes, I know. But here the situation is that I arrive a place with two packages taken from two different shops, the packages are for this same place, but they are actually delivered individually. I know here the 2 packages are simultaneously delivered because they start at the same time. I have tried to change the start time of the second delivery to the time after the first one has been delivered. It really solved the "error: for one postman, the solution must be sorted by arrival time!" error. But it still penalizes me a cost of 30 with the error "error: one order must be deliveried one time!". It's just not right. ------------------------- ReUrgentQuestion about evaluation program This is the right answer: D0001,S631,627,627,6,E4641 D0001,S621,628,629,2,E4490 D0001,B2706,750,759,-2,E4490 D0001,B2706,759,771,-2,E4641 The cost of it is 509, can save 579 - 509 = 70, not to mention the other benefit by saving one individual O2O order. But the evaluation program penalizes me 30 for "error: one order must be deliveried one time!", and that is just not right and should be corrected for fairness. ------------------------- 回 4楼iceman0923的帖子 Yes, you are right. My neglect. So I guess the evaluation program is correct in this one.
meowmeowmeow 2019-12-02 02:37:30 0 浏览量 回答数 0

回答

回 楼主wp客的帖子 但wp数据库配置无法配置 ------------------------- 回 楼主wp客的帖子但wp数据库配置无法配置    ------------------------- 回 5楼dongshan8的帖子哦谢谢 哦谢谢,但感觉是远程站点没有显示出来,htdocs前还有问号显示,如果是连得上,这不应该啊 ------------------------- 回 7楼dongshan8的帖子 没有,显示:Internal Server Error The server encountered an internal error or misconfiguration and was unable to complete your request. Please contact the server administrator, webmaster@syu31xxxx01.my3w.com and inform them of the time the error occurred, and anything you might have done that may have caused the error. More information about this error may be available in the server error log.,能解析下咋回事吗 ------------------------- 回 9楼dongshan8的帖子 谢谢你
wp客 2019-12-01 23:37:46 0 浏览量 回答数 0

问题

fastdfs安装nginx插件报错?报错

In file included from /home/soft/fastdfs-nginx-module/src//ngx_http_fastdfs_module.c:6: /home/soft/fastdfs-nginx-module/...
爱吃鱼的程序员 2020-06-14 16:11:43 0 浏览量 回答数 1

问题

初学Spring Boot,Maven install报错?报错

求助!项目使用spring boot APP正常运行,尝试着打包maven install爆出如下错误: 我在使用ssm(非Spring boot)能够正常instal...
爱吃鱼的程序员 2020-06-06 15:09:24 0 浏览量 回答数 1

问题

刚才错了现在有好了

org.springframework.jdbc.UncategorizedSQLException: ### Error updating database. Cause: java.sql.SQLException: The My...
码农正在 2019-12-01 19:34:40 156 浏览量 回答数 0

问题

如何开启数据库的函数,存储过程,事件。触发器功能?

1、sqlyog 用root权限登陆后,无法开启数据库的事件功能 2、4 queries executed, 0 success, 4 errors, 0 warnings Query: SET GLOBA...
云星一号 2019-12-01 19:04:03 129 浏览量 回答数 0

问题

shell 脚本执行mvn clean install 报错?报错

[INFO] Scanning for projects... [INFO] ------------------------------------------------------------------------ [INFO]...
爱吃鱼的程序员 2020-06-22 19:01:27 0 浏览量 回答数 1

回答

邮件被退回 edoctor@medmail.com.cn,您好: 您发送到 fenghonghlin@aliyun.com 的邮件被收件人服务器拒收了,对方服务器返回的原因如下: SMTP error, RCPT TO: 554 delivery error: dd This user doesn't have a aliyun.com e-mailaccount ( fenghonghlin@aliyun.com) [0] - mx1.aliyun.com. 您的原信请看附件。 Dear edoctor@medmail.com.cn, Your message to fenghonghlin@aliyun.com was rejected by the recipient domain. The error that the other server returned was: " SMTP error, RCPT TO: 554 delivery error: dd This user doesn't have a aliyun.com e-mailaccount ( fenghonghlin@aliyun.com) [0] - mx1.aliyun.com". Your original message is included as attachment. ---------------- This message is generated by Coremail. 您收到的是来自 Coremail 专业邮件系统的信件.
dongguangtao 2019-12-02 02:22:24 0 浏览量 回答数 0

问题

红帽安装ImageMagick出错? 400 报错

红帽安装ImageMagick出错? 400 报错 在红帽5.5上安装ImageMagick,报错 make[1]: *** [magick/magick_libMagickCore_la-animate.lo] Erro...
爱吃鱼的程序员 2020-06-04 11:53:52 4 浏览量 回答数 1

回答

Re请问高手,我的漏洞算不算修复成功了呢? 按照最新的方法进行再一次修复后,命令:env x='() { :;}; echo vulnerable' bash -c "echo this is a test" 不再显示如下字符了: bash: warning: x: ignoring function definition attempt   bash: error importing function definition for `x'   this is a test ------------------以下是方法--------------------------------------- 你可以使用命令:env x='() { :;}; echo vulnerable' bash -c "echo this is a test"     测试是否修复。 修复前   输出:     vulnerable     this is a test     使用修补方案修复后   bash: warning: x: ignoring function definition attempt   bash: error importing function definition for `x'   this is a test ------------------------- Re请问高手,我的漏洞算不算修复成功了呢? 引用第3楼小猪猪于2014-09-26 23:39发表的  : 修复成功了 这么说来 昨天另外一个版主提供的老方法修复不行了?
wdlm.cn 2019-12-02 00:33:59 0 浏览量 回答数 0

问题

Android下面构建失败,Who can help me?!?报错

项目根目录下运行ant release报错: BUILD FAILED /home/adt-bundle-linux-x86_64-20130717/sdk/tools/ant/build.xml:885: The follo...
爱吃鱼的程序员 2020-06-22 14:46:40 0 浏览量 回答数 1

回答

Re升级安装php5.6.9错误 发现图片不能显示....有点蛋疼啊 错误提示是这样的: www/php-5.6.9/ext/iconv/iconv.c: In function ?.m_startup_miconv?. /www/php-5.6.9/ext/iconv/iconv.c:283: error: ?.libiconv_version?.undeclared (first use in this function) /www/php-5.6.9/ext/iconv/iconv.c:283: error: (Each undeclared identifier is reported only once /www/php-5.6.9/ext/iconv/iconv.c:283: error: for each function it appears in.) make: *** [ext/iconv/iconv.lo] Error 1 ------------------------- 回3楼ivmmff的帖子 那个wdcp的php升级脚本也是编译错误.. ------------------------- 回5楼ivmmff的帖子 我是2G内存
寰宇之上 2019-12-01 23:23:18 0 浏览量 回答数 0

回答

不能。。。。。。。。。。 ------------------------- 回 4楼(ap4041t4n) 的帖子 ERROR The requested URL could not be retrieved While trying to retrieve the URL: The following error was encountered:     Access Denied.     Access control configuration prevents your request from being allowed at this time. Please contact your service provider if you feel this is incorrect. Your cache administrator is 818@tianya.cn. Generated Wed, 03 Jul 2013 07:04:47 GMT by piccache220.tianya.cn (squid/2.6.STABLE22)
北京小顽童 2019-12-02 01:32:42 0 浏览量 回答数 0

回答

回 1楼(云代维) 的帖子 如果已经支持了rewrite,直接在你要做的站点配置文件里面添加以下代码,注意修改域名为你要做的域名。 ----------------------------- Options +FollowSymLinks RewriteEngine on RewriteCond %{HTTP_HOST} ^php100.com RewriteRule ^(.*)$ http://www.php100.com/$1 [R=permanent,L] ---------------------------------------------------------------- 这个配置应该写在哪里?http.conf?还是.htaccess里?不过我写在哪里都不好用 ------------------------- 回 3楼(火蓝云) 的帖子 <ifmodule mod_rewrite.c> RewriteEngine on   RewriteLog "D:/apache22/logs/rewrite.log"   RewriteCond %{HTTP_HOST}!^www.baidu.com [NC]         RewriteRule ^/(.*) http://www.baidu.com:8083/ [R=301,L] </ifmodule> 我在htaccess文件中这么写的(windows系统),访问页面时,提示 Internal Server Error The server encountered an internal error or misconfiguration and was unable to complete your request. Please contact the server administrator, webmaster@dummy-host.jrmart.com and inform them of the time the error occurred, and anything you might have done that may have caused the error. More information about this error may be available in the server error log. 这是哪里不对?
2019-12-02 02:18:00 0 浏览量 回答数 0

回答

回 1楼(dongshan8) 的帖子 按照您的方法修改了。可是出现如下错误: Forbidden You don't have permission to access / on this server. Additionally, a 500 Internal Server Error error was encountered while trying to use an ErrorDocument to handle the request. ------------------------- 求助啊~~~~! ------------------------- 回 4楼(dongshan8) 的帖子 没有啊。。。
jeffc 2019-12-02 02:04:37 0 浏览量 回答数 0

问题

多个httpd服务,怎么在系统启动时调用指定的httpd或者删除没用到的那个

WEB目录位置 : /mnt/www 问题描述 : 您好我购买的 阿里云linux一键安装web环境<专业版> 安装环境,但是重启之后 路径会变成 /var/www/html/而不是我设置的 /mnt/www ,因为我这里有两个...
meiyiren 2019-12-01 19:29:40 3071 浏览量 回答数 0

问题

Android下面构建失败,Who can help me?!? 400 报错

Android下面构建失败,Who can help me?!? 400 报错 项目根目录下运行ant release报错: BUILD FAILED /home/adt-bund...
爱吃鱼的程序员 2020-06-01 11:43:43 0 浏览量 回答数 1

回答

回1楼鬼才神兵的帖子 是WDCP ------------------------- ReECSLinux如何将php5.2.17p1升级成php5.3 在线等 ------------------------- 回5楼鬼才神兵的帖子 /iconv.lo /root/php-5.3.29/ext/iconv/iconv.c: In function ‘zm_startup_miconv’: /root/php-5.3.29/ext/iconv/iconv.c:254: error: ‘_libiconv_version’ undeclared (first use in this function) /root/php-5.3.29/ext/iconv/iconv.c:254: error: (Each undeclared identifier is reported only once /root/php-5.3.29/ext/iconv/iconv.c:254: error: for each function it appears in.) make: *** [ext/iconv/iconv.lo] Error 1 make err You have new mail in /var/spool/mail/root 安装好几次,一直都是提示iconv函数错误    我已经单独安装了iconv ------------------------- 回8楼鬼才神兵的帖子 还是不行,出现同样的错误     ……… make: *** [ext/iconv/iconv.lo] Error 1 make err ------------------------- 回10楼鬼才神兵的帖子 wget http://wdcp.vestavps.com/upgrade/php_up53.sh sh php_up53.sh 系统默认php5.2.17p1要升级到php5.3 ------------------------- 回5楼鬼才神兵的帖子 谢谢,弄好了,真的是师傅呀
fookxu 2019-12-01 23:55:18 0 浏览量 回答数 0

问题

错误1044(42000):用户'@'localhost'对数据库'db'的访问被拒绝?mysql

我想开始在MySQL中编写查询。 show grants 显示: +--------------------------------------+ | Grants for @localhost |...
保持可爱mmm 2020-05-17 09:34:55 1 浏览量 回答数 1

问题

perconna xtrabackup 全备mysql5.5还原到5.6上报错?报错

2017-01-17 16:21:10 8154 [ERROR] Column count of mysql.events_waits_current is wrong. Expected 19, found 16. Created wit...
爱吃鱼的程序员 2020-06-08 17:38:22 0 浏览量 回答数 1

问题

执行maven命令 clean tomcat7:run 报错?报错

[INFO] Scanning for projects... [INFO] ------------------------------------------------------------------------ [INFO] R...
爱吃鱼的程序员 2020-06-08 12:29:09 0 浏览量 回答数 1

问题

求大神相助!500 internal server error

之前是阿里的免费空间,但因目前流量不够用,然后进行主机升级了,现在是 共享云虚拟主机,升级前一切正常,升级后,网站也能正常打开,采用用户名密码...
wangchenghn1 2019-12-01 21:31:44 5153 浏览量 回答数 4

问题

mvn install命令时,一直报错:不兼容的类型 [ERROR] 找到: j?报错

运行环境是64位的win7,maven是3.0.5,jdk是1.6.0_43. mvn clean命令时,是能够清理的,但执行mvn install命令时,一直报这个错,求大神指引!!!非常感谢!!! [INFO] Scanning...
爱吃鱼的程序员 2020-06-09 15:43:05 0 浏览量 回答数 1

回答

zhe这难道是opencv的一个bug???###### 我在google上得到: problem with libv4l2 Hi, I've looked for some post with my problem but I haven't found. I have started to use opencv with Harpia without problems. Today, I have decided to install the latest version of opencv. After the installation, I've re-compile my source and I've encountered this error:   "...(software runs correctly)...   mmap: Invalid argument munmap: Invalid argument munmap: Invalid argument munmap: Invalid argument munmap: Invalid argument Unable to stop the stream.: Bad file descriptor munmap: Invalid argument munmap: Invalid argument munmap: Invalid argument munmap: Invalid argument libv4l2: error converting / decoding frame data: v4l-convert: error parsing JPEG header: Not a JPG file ?   HIGHGUI ERROR: V4L: Could not SYNC to video stream. Input/output error   ...(software runs correctly)   Segmentation fault"   The error is generated by this code:   ImgCap = cvCaptureFromCAM(0); if(!cvGrabFrame(ImgCap))          printf("Cannot Grab Image from camera 1"); ImgFr1 = cvRetrieveFrame( ImgCap ,0);   and I think that it depends on "static IplImage* icvRetrieveFrameCAM_V4L( CvCaptureCAM_V4L* capture, int)" of cvcap_v4l.cpp   Someone knows the solution of my problem?   I've tried with Opencv 2.0 and 2.1, with a philips spc1300nc and the integrated laptop camera. Same error, while the harpia opencv run correctly.   Thanks   ------------------------------------   Change settings: http://www.yahoogroups.com/mygroups, select    Get Emails (get all posts)    Daily Digest (one summary email per day)    Read on the web (read posts on the web only)Or Unsubscribe by mailing OpenCV-unsubscribe <at> yahoogroups.com   ######和我的问题一样啊!!!!######http://ubuntuforums.org/showthread.php?t=1453004 这个人的问题也和我一样
montos 2020-05-29 21:15:45 0 浏览量 回答数 0

回答

zhe这难道是opencv的一个bug???###### 我在google上得到: problem with libv4l2 Hi, I've looked for some post with my problem but I haven't found. I have started to use opencv with Harpia without problems. Today, I have decided to install the latest version of opencv. After the installation, I've re-compile my source and I've encountered this error:   "...(software runs correctly)...   mmap: Invalid argument munmap: Invalid argument munmap: Invalid argument munmap: Invalid argument munmap: Invalid argument Unable to stop the stream.: Bad file descriptor munmap: Invalid argument munmap: Invalid argument munmap: Invalid argument munmap: Invalid argument libv4l2: error converting / decoding frame data: v4l-convert: error parsing JPEG header: Not a JPG file ?   HIGHGUI ERROR: V4L: Could not SYNC to video stream. Input/output error   ...(software runs correctly)   Segmentation fault"   The error is generated by this code:   ImgCap = cvCaptureFromCAM(0); if(!cvGrabFrame(ImgCap))          printf("Cannot Grab Image from camera 1"); ImgFr1 = cvRetrieveFrame( ImgCap ,0);   and I think that it depends on "static IplImage* icvRetrieveFrameCAM_V4L( CvCaptureCAM_V4L* capture, int)" of cvcap_v4l.cpp   Someone knows the solution of my problem?   I've tried with Opencv 2.0 and 2.1, with a philips spc1300nc and the integrated laptop camera. Same error, while the harpia opencv run correctly.   Thanks   ------------------------------------   Change settings: http://www.yahoogroups.com/mygroups, select    Get Emails (get all posts)    Daily Digest (one summary email per day)    Read on the web (read posts on the web only)Or Unsubscribe by mailing OpenCV-unsubscribe <at> yahoogroups.com   ######和我的问题一样啊!!!!######http://ubuntuforums.org/showthread.php?t=1453004 这个人的问题也和我一样
kun坤 2020-06-05 23:11:27 0 浏览量 回答数 0

问题

maven 编译报错,急救~~~?报错

D:\dev\Java\jdk1.8.0_66\bin\java -Dmaven.multiModuleProjectDirectory=D:\dev\IdeaProjects\jhope\jhope.core -Dmaven.ho...
爱吃鱼的程序员 2020-06-10 13:46:51 1 浏览量 回答数 1

回答

[root@localhost ImageMagick-6.4.0]# make make  all-am make[1]: Entering directory `/usr/local/ImageMagick-6.4.0' /bin/sh ./libtool --silent --tag=CC   --mode=compile gcc -DHAVE_CONFIG_H -I. -I./config     -g -O2 -Wall -W -pthread -MT coders/coders_art_la-art.lo -MD -MP -MF coders/.deps/coders_art_la-art.Tpo -c -o coders/coders_art_la-art.lo `test -f 'coders/art.c' || echo './'`coders/art.c mv -f coders/.deps/coders_art_la-art.Tpo coders/.deps/coders_art_la-art.Plo /bin/sh ./libtool --silent --tag=CC   --mode=compile gcc -DHAVE_CONFIG_H -I. -I./config  -I./ltdl -I./ltdl    -g -O2 -Wall -W -pthread -MT magick/magick_libMagickCore_la-animate.lo -MD -MP -MF magick/.deps/magick_libMagickCore_la-animate.Tpo -c -o magick/magick_libMagickCore_la-animate.lo `test -f 'magick/animate.c' || echo './'`magick/animate.c In file included from ./magick/animate-private.h:26,                  from magick/animate.c:44: ./magick/xwindow-private.h:27:21: error: X11/Xos.h: No such file or directory ./magick/xwindow-private.h:28:22: error: X11/Xlib.h: No such file or directory ./magick/xwindow-private.h:29:23: error: X11/Xatom.h: No such file or directory ./magick/xwindow-private.h:30:28: error: X11/cursorfont.h: No such file or directory ./magick/xwindow-private.h:31:24: error: X11/keysym.h: No such file or directory ./magick/xwindow-private.h:32:27: error: X11/Xresource.h: No such file or directory ./magick/xwindow-private.h:33:23: error: X11/Xutil.h: No such file or directory In file included from ./magick/animate-private.h:26,                  from magick/animate.c:44: ./magick/xwindow-private.h:142: error: expected specifier-qualifier-list before 'Pixmap' ./magick/xwindow-private.h:192: error: expected specifier-qualifier-list before 'XFontStruct' ./magick/xwindow-private.h:215: error: expected specifier-qualifier-list before 'XColor' ./magick/xwindow-private.h:240: error: expected specifier-qualifier-list before 'XrmDatabase' ./magick/xwindow-private.h:346: error: expected specifier-qualifier-list before 'Window' ./magick/xwindow-private.h:451: error: expected specifier-qualifier-list before 'Display' ./magick/xwindow-private.h:507: error: expected ')' before 'const' ./magick/xwindow-private.h:512: error: expected '=', ',', ';', 'asm' or '__attribute__' before 'XMakeCursor' ./magick/xwindow-private.h:515: error: expected ')' before '*' token ./magick/xwindow-private.h:519: error: expected ')' before '*' token ./magick/xwindow-private.h:531: error: expected ')' before '*' token ./magick/xwindow-private.h:568: error: expected '=', ',', ';', 'asm' or '__attribute__' before 'XWindowByID' ./magick/xwindow-private.h:573: error: expected '=', ',', ';', 'asm' or '__attribute__' before '*' token ./magick/xwindow-private.h:576: error: expected '=', ',', ';', 'asm' or '__attribute__' before 'XGetResourceDatabase' ./magick/xwindow-private.h:579: error: expected '=', ',', ';', 'asm' or '__attribute__' before '*' token ./magick/xwindow-private.h:582: error: expected ')' before '*' token ./magick/xwindow-private.h:585: warning: type defaults to 'int' in declaration of 'XColor' ./magick/xwindow-private.h:585: error: expected ';', ',' or ')' before '*' token In file included from magick/animate.c:44: ./magick/animate-private.h:29: error: expected ')' before '*' token ./magick/animate-private.h:32: error: expected ')' before '*' token In file included from magick/animate.c:68: ./magick/widget.h:30: error: expected ')' before '*' token ./magick/widget.h:36: error: expected ')' before '*' token ./magick/widget.h:40: error: expected ')' before '*' token magick/animate.c:237: error: expected ')' before '*' token magick/animate.c:241: error: expected ')' before '*' token magick/animate.c: In function 'AnimateImages': magick/animate.c:276: error: 'Display' undeclared (first use in this function) magick/animate.c:276: error: (Each undeclared identifier is reported only once magick/animate.c:276: error: for each function it appears in.) magick/animate.c:277: error: 'display' undeclared (first use in this function) magick/animate.c:282: error: 'XrmDatabase' undeclared (first use in this function) magick/animate.c:283: error: expected ';' before 'resource_database' magick/animate.c:294: warning: implicit declaration of function 'XOpenDisplay' magick/animate.c:295: error: expected expression before ')' token magick/animate.c:298: warning: implicit declaration of function 'XDisplayName' magick/animate.c:299: warning: format '%s' expects type 'char *', but argument 8 has type 'int' magick/animate.c:304: warning: implicit declaration of function 'XSetErrorHandler' magick/animate.c:304: error: 'XError' undeclared (first use in this function) magick/animate.c:305: error: 'resource_database' undeclared (first use in this function) magick/animate.c:305: warning: implicit declaration of function 'XGetResourceDatabase' magick/animate.c:307: warning: implicit declaration of function 'XGetResourceInfo' magick/animate.c:309: error: 'XResourceInfo' has no member named 'image_geometry' magick/animate.c:310: error: 'XResourceInfo' has no member named 'immutable' magick/animate.c:312: warning: implicit declaration of function 'XAnimateImages' magick/animate.c:314: warning: implicit declaration of function 'XCloseDisplay' magick/animate.c:315: warning: implicit declaration of function 'XDestroyResourceInfo' magick/animate.c: At top level: magick/animate.c:358: error: expected ')' before '*' token magick/animate.c:722: error: expected ')' before '*' token magick/animate.c:1179: error: expected ')' before '*' token magick/animate.c:2828: error: expected ')' before '*' token make[1]: *** [magick/magick_libMagickCore_la-animate.lo] Error 1 make[1]: Leaving directory `/usr/local/ImageMagick-6.4.0' make: *** [all] Error 2 重新发送以下错误信息 ###### 重发错误 /magick_libMagickCore_la-animate.lo ###### ./magick/xwindow-private.h:27:21: error: X11/Xos.h: No such file or directory 上面不是有这句么 X11找不到嘛 我也整了好久 只要在ocnfigure 的时候wintout x11 就可以了  ./configure --without-x make && make install
爱吃鱼的程序员 2020-06-04 16:48:03 0 浏览量 回答数 0
阿里云企业服务平台 陈四清的老板信息查询 上海奇点人才服务相关的云产品 爱迪商标注册信息 安徽华轩堂药业的公司信息查询 小程序定制 上海微企信息技术相关的云产品 国内短信套餐包 ECS云服务器安全配置相关的云产品 天籁阁商标注册信息 开发者问答 阿里云建站 自然场景识别相关的云产品 万网 小程序开发制作 视频内容分析 视频集锦 代理记账服务 北京芙蓉天下的公司信息查询