• An internal error occurred during:"...

    An error has occurred.See error log for more details. 详细错误: An error has occurred.See error log for more details. java.lang.NullPointerException 重新启动Eclipse之后提示以下两个错误: An internal ...
    文章 2015-05-13 1545浏览量
  • SignTool Error:An error occurred while attempting/...

    SignTool Error:An error occurred while attempting to timestamp:TPlayer Core.dll SignTool Error:An unexpected internal error has occurred. Error information:&34;SignerTimeStamp()failed.&34;(-2147012889...
    文章 2021-12-10 97浏览量
  • SignTool Error:An error occurred while attempting/...

    SignTool Error:An error occurred while attempting to timestamp:TPlayer Core.dll SignTool Error:An unexpected internal error has occurred. Error information:&34;SignerTimeStamp()failed.&34;(-2147012889...
    文章 2023-01-23 5浏览量
  • MyEclipse10.6安装pydev过程报错Problems downloading...

    An error occurred while processing the signatures for the file:D:\Users\zhengyl\AppData\Local\Temp\signatureFile6771126166501550159.jar Problems downloading artifact:osgi.bundle,...
    文章 2017-11-07 1318浏览量
  • eclipse异常解决:Errors occurred during the build....

    Errors occurred during the build. Errors running builder 'Mule 3 hot deployment 这个异常 在eclipse中弹出。Errors occurred during the build.异常提示 解决的方法,具体操作如下: 选择一个项目—-右键...
    文章 2017-11-15 1875浏览量
  • ORA-04021

    Error:ORA 4021Text:time-out occurred while waiting to lock object-Cause:While trying to lock a library object,a time-out occurred.Action:Retry the operation later. Bug 3386590 4021:TIMEOUT OCCURRED ...
    文章 2010-07-16 685浏览量
  • provider:SQL Network Interfaces,error:26-Error ...

    A network-related or instance-specific error occurred while establishing a connection to SQL Server.The server was not found or was not accessible.Verify that the instance name is correct and that SQL...
    文章 2011-12-29 1358浏览量
  • An internal error has occurred(L03T 0152 H)– ...

    SAP WM LT03 Error Msg-An internal error has occurred (L03T 0152 H)– 之对策 LT03 试图为交货单 81749010 创建TO 单,系统报错如下: 经查,需要修改相应的WM 移动类型的配置, 把311 移动类型...
    文章 2016-06-28 2312浏览量
  • java.sql.SQLException:ORA-00604:error occurred at ...

    java.sql.SQLException:ORA-00604:error occurred at recursive SQL level 1 ORA-12705:Cannot access NLS data files or invalid environment specified方法一:跟换驱动jar包:...只需在eclipse目录下找到eclipse.ini...
    文章 2011-03-08 956浏览量
  • 解决Eclipse里Maven工程报 An error occurred while ...

    这几天被maven的单元测试折腾死了,以为是自己的eclipse有问题呢,今天早上来了又发现eclipse报了一个很奇怪的错误:An error occurred while filtering resources 后来搞了好久,才得到了解决办法: 在出错的项目上...
    文章 2016-04-08 1200浏览量
  • 执行eclipse.exe时,出现错误An error has occurred....

    安装eclipse时,执行eclipse.exe时,出现错误An error has occurred.See the logfile问题 因为系统安装有Oracle 9i,Oracle 9i会在你的环境变量里的path设定jvm的版本,所以系统会抓到1.3.1的版本,导致不能使用...
    文章 2012-07-25 783浏览量
  • An internal error occurred during:"Loading ...

    An error has occurred.See error log for more details. 详细错误: An error has occurred.See error log for more details. java.lang.NullPointerException 重新启动Eclipse之后提示以下两个错误: An internal ...
    文章 2015-05-13 1733浏览量
  • Incorrect key file for table解决方法

    The error occurred in sql/Scene.xml. The error occurred while applying a parameter map. Check the insertBoxLogTmp-InlineParameterMap. Check the statement(update failed). Cause:...
    文章 2017-11-23 1879浏览量
  • A failure occurred while executing ...

    A failure occurred while executing com.android.build.gradle.tasks.MergeResources$FileGenerationWorkAction>Error while processing D:\androidProject\KuaiChuan-master\app\src\main\res\drawable\ic_...
    文章 2022-01-19 86浏览量
  • ERROR node.Application:A fatal error occurred ...

    flume-ng agent-name a1-conf$FLUME_HOME/conf-conf-file$FLUME_HOME/conf/flume.conf-Dflume.root.logger&61;INFO,console
    文章 2022-12-29 14浏览量
  • A generic error occurred in GDI+的解决方案

    转自智慧光原文A generic error occurred in GDI+.解决方法 使用image1.RotateFlip(RotateFlipType.Rotate90FlipNone)方法时候,出现错误: An unhandled exception of type 'System.Runtime.InteropServices....
    文章 2017-11-20 1953浏览量
  • An internal error occurred during:"Retrieving ...

    An internal error occurred during:"Retrieving archetypes:".GC overhead limit exceeded 异常,分享牛系列,分享牛专栏,分享牛。出现这种情况是什么原因造成的呢?1.肯定是jvm抛出的异常。2.eclipse或者...
    文章 2016-05-27 1739浏览量
  • SAP LSMW 事务代码...EXCEPTION has occurred-之分析

    SAP LSMW 事务代码HUPAST的录屏后台执行报错-Runtime error RAISE_EXCEPTION has occurred-之分析因项目上成品库存管理启用了handling unit management功能&xff0c;所以在库存初始化的时候&xff0c;在MB1C&43;561导入...
    文章 2021-12-24 133浏览量
  • SAP LSMW 事务代码...EXCEPTION has occurred-之分析

    SAP LSMW 事务代码HUPAST的录屏后台执行报错-Runtime error RAISE_EXCEPTION has occurred-之分析因项目上成品库存管理启用了handling unit management功能&xff0c;所以在库存初始化的时候&xff0c;在MB1C&43;561导入...
    文章 2021-12-24 137浏览量
  • 无法提升此功能级别 目录服务忙

    21548 failures have occurred since the last success. [DCBACK]DsBindWithSpnEx()failed with error 1722, RPC 服务器不可用。[Replications Check,SERVER2]A recent replication attempt failed: From DCBACK to ...
    文章 2017-11-28 1648浏览量
  • 在阿里云 ECS 上试图安装 SAP Commerce Cloud 的 137 ...

    608807BUILD FAILED/root/jerry/hybris/bin/platform/build.xml:106:The following error occurred while executing this line:/root/jerry/hybris/bin/platform/resources/ant/antmacros.xml:807:The following ...
    文章 2021-12-03 62浏览量
  • 解决IIS7运行ASP提示错误:An error occurred on the ...

    原文:解决IIS7运行ASP提示错误:An error occurred on the server when processing the URL.Please contact the system administrator 在WINDOWS7或SERVER2008上安装了IIS7,调试ASP程序时出现以下错误: An error ...
    文章 2014-07-02 1267浏览量
  • salt stack Demo Environments

    master:An error occurred.The error will be shown after all tasks complete. gt;minion1:An error occurred.The error will be shown after all tasks complete. gt;minion2:An error occurred.The error will be...
    文章 2016-04-20 1232浏览量
  • maven内存不足:Unexpected error occurred:Not ...

    具体错误[ERROR]Failed to execute goal org.teavm:teavm-maven-plugin:0.6.0-SNAPSHOT:compile(wasm-client)on project teavm-samples-benchmark:Unexpected error occurred:Not enough memory to allocate buffers...
    文章 2021-12-09 133浏览量
  • maven内存不足:Unexpected error occurred:Not ...

    具体错误[ERROR]Failed to execute goal org.teavm:teavm-maven-plugin:0.6.0-SNAPSHOT:compile(wasm-client)on project teavm-samples-benchmark:Unexpected error occurred:Not enough memory to allocate buffers...
    文章 2023-01-16 2浏览量
  • Errors occurred during the build.Errors running ...

    每次保存项目时总是报错:Errors occurred during the build.Errors running builder 'Checkstyle Builder' on project。CheckStyle也无法运行。问题原因: 当前项目CheckStyle配置文件的check-config-...
    文章 2016-02-19 2322浏览量
  • JSP导入XML不成功的一个原因

    错误消息HTTP Status 500 – Internal Server ErrorType Exception ReportMessage An exception occurred processing[/main.jsp]...An exception occurred processing[/main.jsp]at line[12]9:10:Books Info:11:12:13:
    文章 2021-12-03 43浏览量
  • ORA 4021

    CauseThere is a lock on a library object when doing the export.Error:ORA 4021Text:time-out occurred while waiting to lock object-Cause:While trying to lock a library object,a time-out occurred.Action:...
    文章 2010-07-16 672浏览量
  • Android Studio 编译报错(A problem occurred ...

    A problem occurred starting process&39;command&39;D:\001_Programs\001_Android\002_Sdk\Sdk\cmake\3.10.2.4988404\bininja.exe&39;39;Try: Run with-stacktrace option to get the stack trace.Run with-info ...
    文章 2022-02-04 425浏览量
  • MSN 突然无法登陆,错误0xc000000d occurred at 0x...

    今天MSN无缘无故就上不出去了,弹出个这个错误:“The exception unknown software exception(0xc000000d)occurred in the application at location 0x0107d8ea.”Windows XP:在启动时遇到提示“应用程序异常...
    文章 2010-02-05 930浏览量
1 2 3 4 ... 80 >

云产品推荐

视频直播 大数据计算服务 MaxCompute 国内短信套餐包 开发者问答 阿里云建站 新零售智能客服 万网 小程序开发制作 视频内容分析 视频集锦 代理记账服务 阿里云AIoT 阿里云科技驱动中小企业数字化